{"text_format":"1","workbook":"xlsx","n_sheets":3,"sheets":["Read me - LAs","Level 1 Screening","Calculations"],"not_rendered":{"charts":0,"images":2,"macros":1,"external_links":0,"defined_names":4,"comments":0,"pivot_tables":0},"unopened":[],"bounds":{"document_bytes":16777216,"sheet_cells":100000,"rows_first":2000,"rows_last":500,"rows_between":2000,"halvings":0,"cell_chars":16384,"cell_head_chars":4096},"cells_cut":0,"cells_raw":0,"read":"whole","date_system":"1900"}

{"sheet":"Read me - LAs","index":0,"n_rows":22,"n_cols":3,"rows_kept":22,"cut":false,"hidden":false,"merged":[]}
[]
[]
[]
[]
[]
[]
[]
[null,null,"JBA Strategic Flood Risk Assessment Site Screening Tool - v1.0"]
[]
[null,null,"This spreadsheet has been designed to assist local authorities with the selection of development sites for inclusion within their local plan."]
[]
[null,null,"Note on calculations:"]
[null,null,"Site boundaries have been screened against flood risk information to determine the proportion of the site at risk.  The following flood risk information has been used in the assessment\n●  Flood Zones (from Environment Agency Flood Zones and results from detailed hydraulic models)\n●  Surface Water (from the Risk of Flooding from Surface Water mapping)\n●  Environment Agency's Historic Flood Map\n●  Reservoirs (from the National Reservoir Inundation Mapping)"]
[]
[null,null,"Additional information:"]
[null,null,"The sites have also been considered against the following information to provide additional information to support decision making\n●  Located in an IDB administrative area - to determine if the site may be affected by an IDB watercourse\n●  Defended? - to determine if the site benefits from formal flood defences\n●  Ordinary watercourse with catchment less than 3km2 flowing adjacent  - to determine if their is a watercourse with a catchment less than 3km2 flowing through or adjacent to a site, which would not have been included in the Environment Agency's Flood Zones"]
[]
[null,null,"Note on Flood Zone and Surface Water percentages:"]
[null,null,"The values quoted in the Level 1 Screening tab show the percentage of the site at flood risk from that particular Flood Zone / event, including the percentage of the site at flood risk at a higher zone.  \n\nFor example\n50% of a site is in the Flood Zones.  Taking each Flood Zone individually, 50% is in Flood Zone 2 but only 30% is in Flood Zone 3a and only 10% is in Flood Zone 3b.\nIn the Level 1 Screening tab this will be displayed as stated above, i.e. the total % of that particular Flood Zone in that site.  \nIf you would like to know how much of the site is in say Flood Zone 2 'only' (i.e. less the overlapping Flood Zone 3) then these percentages can be subtracted, e.g. 50% of the site is in Flood Zone 2, but as 30% is in Flood Zone 3 (which overlaps Flood Zone 2), this leaves 20% of the site in Flood Zone 2 'only'.\nNote that the FZ3a and FZ3b used in the screening is derived from the 100-year undefended and 20-year (or 25-year) defended model outlines supplied by the Environment Agency where available respectively. Where no modelled data was available, the Environment Agency Flood Mapping for Planning Flood Zone 3 was used to give an \"Indicative 3b\". Therefore, it is common for the percentage of a site located in FZ3a to be the same as the percentage of the site located in FZ3b, as they will only differ where modelled data is available."]
[]
{"$rows_left_out":3}
{"sheet":"Level 1 Screening","index":1,"n_rows":798,"n_cols":10,"rows_kept":798,"cut":false,"hidden":false,"merged":[[7,0,8,0],[7,2,8,2],[7,9,8,9],[7,1,8,1],[7,3,7,8],[8,3,8,5],[8,6,8,8]]}
[]
[]
[]
[]
[]
[]
[]
["Site code","Location","Area (ha)",null,null,null,null,null,null,"Area of site outside of Flood Zones"]
[null,null,null,null,null,null,"Risk of flooding from surface water (Total %s)"]
[null,null,null,"FZ 3a"," FZ 2","FZ 1","30yr","100yr","1,000yr","(hectares)"]
[{"$f":"Calculations!B2","v":203},{"$f":"Calculations!A2","v":"Land south of Pedmore Lane, Pedmore, Stourbridge"},{"$f":"Calculations!C2","v":8.5399999999999991},{"$f":"Calculations!G2","v":0},{"$f":"Calculations!O2","v":0},{"$f":"Calculations!P2","v":1},{"$f":"Calculations!U2","v":0},{"$f":"Calculations!X2","v":0},{"$f":"Calculations!AB2","v":0},{"$f":"C11*F11","v":8.5399999999999991}]
[{"$f":"Calculations!B3","v":203},{"$f":"Calculations!A3","v":"Land south of Pedmore Lane, Pedmore, Stourbridge"},{"$f":"Calculations!C3","v":11.23},{"$f":"Calculations!G3","v":0},{"$f":"Calculations!O3","v":0},{"$f":"Calculations!P3","v":1},{"$f":"Calculations!U3","v":"<1%"},{"$f":"Calculations!X3","v":4.3732326825814783E-4},{"$f":"Calculations!AB3","v":2.7200208205817454E-3},11.23]
[{"$f":"Calculations!B4","v":138},{"$f":"Calculations!A4","v":"Land North of Linthouse Lane, south of the Dismantled Railway Line, west of Kitchen Lane and east of"},{"$f":"Calculations!C4","v":148},{"$f":"Calculations!G4","v":0},{"$f":"Calculations!O4","v":0},{"$f":"Calculations!P4","v":1},{"$f":"Calculations!U4","v":"<1%"},{"$f":"Calculations!X4","v":2.8466731599671152E-3},{"$f":"Calculations!AB4","v":4.1120589547889658E-3},148]
[{"$f":"Calculations!B5","v":192},{"$f":"Calculations!A5","v":"Land at Perton Road, Perton"},{"$f":"Calculations!C5","v":2.4},{"$f":"Calculations!G5","v":0},{"$f":"Calculations!O5","v":0},{"$f":"Calculations!P5","v":1},{"$f":"Calculations!U5","v":0},{"$f":"Calculations!X5","v":0},{"$f":"Calculations!AB5","v":0},2.4]
[{"$f":"Calculations!B6","v":187},{"$f":"Calculations!A6","v":"Dadford’s Bridge Industrial Estate, Plant Street Wordsley"},{"$f":"Calculations!C6","v":0.46},{"$f":"Calculations!G6","v":0},{"$f":"Calculations!O6","v":0},{"$f":"Calculations!P6","v":1},{"$f":"Calculations!U6","v":0},{"$f":"Calculations!X6","v":0},{"$f":"Calculations!AB6","v":3.4006504528254343E-2},0.46]
[{"$f":"Calculations!B7","v":185},{"$f":"Calculations!A7","v":"Opposite One Hundred acre school, Aldridge Road, Walsall"},{"$f":"Calculations!C7","v":7.5},{"$f":"Calculations!G7","v":0},{"$f":"Calculations!O7","v":0},{"$f":"Calculations!P7","v":1},{"$f":"Calculations!U7","v":6.1327982631985333E-3},{"$f":"Calculations!X7","v":1.9487229937750802E-2},{"$f":"Calculations!AB7","v":0.13856500732156934},7.5]
[{"$f":"Calculations!B8","v":184},{"$f":"Calculations!A8","v":"Merry Hill, Brierley Hill"},{"$f":"Calculations!C8","v":53.06},{"$f":"Calculations!G8","v":0},{"$f":"Calculations!O8","v":0},{"$f":"Calculations!P8","v":1},{"$f":"Calculations!U8","v":2.8880041110052015E-2},{"$f":"Calculations!X8","v":9.5695262758524122E-2},{"$f":"Calculations!AB8","v":0.32269648484456082},53.06]
[{"$f":"Calculations!B9","v":184},{"$f":"Calculations!A9","v":"Merry Hill, Brierley Hill"},{"$f":"Calculations!C9","v":21.85},{"$f":"Calculations!G9","v":0},{"$f":"Calculations!O9","v":0},{"$f":"Calculations!P9","v":1},{"$f":"Calculations!U9","v":1.349243355925748E-2},{"$f":"Calculations!X9","v":4.4647023880873223E-2},{"$f":"Calculations!AB9","v":0.14596653337167689},21.85]
[{"$f":"Calculations!B10","v":183},{"$f":"Calculations!A10","v":"Land at Electrium Point, Forge Road, Willenhall, Walsall"},{"$f":"Calculations!C10","v":0.4},{"$f":"Calculations!G10","v":0},{"$f":"Calculations!O10","v":0},{"$f":"Calculations!P10","v":1},{"$f":"Calculations!U10","v":9.3536290341399986E-3},{"$f":"Calculations!X10","v":2.6353629034139996E-2},{"$f":"Calculations!AB10","v":4.1921844193247501E-2},0.4]
[{"$f":"Calculations!B11","v":182},{"$f":"Calculations!A11","v":"Aldridge Wyevale Garden Centre,  Chester Road, Aldridge, Walsall"},{"$f":"Calculations!C11","v":1.03},{"$f":"Calculations!G11","v":0},{"$f":"Calculations!O11","v":0},{"$f":"Calculations!P11","v":1},{"$f":"Calculations!U11","v":0},{"$f":"Calculations!X11","v":0},{"$f":"Calculations!AB11","v":0},1.03]
{"$rows_left_out":779}
{"sheet":"Calculations","index":2,"n_rows":789,"n_cols":34,"rows_kept":789,"cut":false,"hidden":false,"merged":[]}
["Location","Site Code","Site (ha)","Site (ha) ROUNDED","FZ3a (ha)","FZ3a (ha) ROUNDED","FZ3a (%) acc","FZ3a (%) (MINUS FZ3b)","FZ3a (%)_TOTAL","FZ3a (%) acc","FZ2 (ha)",null,"FZ2 (%)_(MINUS FZ3)","FZ2 (%)_TOTAL","FZ2 (%) acc","FZ1 (%)","HFM (ha)","HFM (%)","SW30 (ha)","SW30 (%)","SW30 (%) acc","SW100 (ha)","SW100 (%)_(MINUS SW30)","SW100 (%)_TOTAL","SW100 (%) acc","SW1000 (ha)","SW1000 (%)_(MINUS SW100)","SW1000 (%)_TOTAL","SW1000 (%) acc","Wolves 30yr (ha)","%","Wolves 100yr (Ha)","%"]
["Land south of Pedmore Lane, Pedmore, Stourbridge",203,8.5399999999999991,{"$f":"ROUND(C2,2)","v":8.5399999999999991},0,{"$f":"ROUND(E2,2)","v":0},{"$f":"F2/D2","v":0},null,{"$f":"#REF!/D2","v":{"$error":"#REF!"}},{"$f":"IF(I2>=0.005,I2,IF(#REF!=0,I2,\"<1%\"))","v":{"$error":"#REF!"}},0,{"$f":"ROUND(K2,2)","v":0},{"$f":"L2-F2","v":0},{"$f":"L2/D2","v":0},{"$f":"IF(N2>=0.005,N2,IF(K2=0,N2,\"<1%\"))","v":0},{"$f":"1-N2","v":1},null,{"$f":"Q2/C2","v":0},0,{"$f":"S2/C2","v":0},{"$f":"IF(T2>=0.005,T2,IF(S2=0,T2,\"<1%\"))","v":0},0,{"$f":"X2-T2","v":0},{"$f":"V2/C2","v":0},{"$f":"IF(W2>=0.005,W2,IF(V2=0,W2,\"<1%\"))","v":0},0,{"$f":"AB2-W2","v":0},{"$f":"Z2/C2","v":0},{"$f":"IF(AA2>=0.005,AA2,IF(Z2=0,AA2,\"<1%\"))","v":0}]
["Land south of Pedmore Lane, Pedmore, Stourbridge",203,11.23,{"$f":"ROUND(C3,2)","v":11.23},0,{"$f":"ROUND(E3,2)","v":0},{"$f":"F3/D3","v":0},{"$f":"I3-#REF!","v":{"$error":"#REF!"}},{"$f":"#REF!/D3","v":{"$error":"#REF!"}},{"$f":"IF(I3>=0.005,I3,IF(#REF!=0,I3,\"<1%\"))","v":{"$error":"#REF!"}},0,{"$f":"ROUND(K3,2)","v":0},{"$f":"L3-F3","v":0},0,{"$f":"IF(N3>=0.005,N3,IF(K3=0,N3,\"<1%\"))","v":0},{"$f":"1-N3","v":1},null,0,3.9046506137799999E-3,{"$f":"S3/C3","v":3.4769818466429207E-4},{"$f":"IF(T3>=0.005,T3,IF(S3=0,T3,\"<1%\"))","v":"<1%"},4.9111403025390004E-3,8.9625083593855765E-5,4.3732326825814783E-4,{"$f":"IF(W3>=0.005,W3,IF(V3=0,W3,\"<1%\"))","v":"<1%"},3.0545833815133001E-2,{"$f":"AB3-W3","v":2.6303957369878898E-3},2.7200208205817454E-3,{"$f":"IF(AA3>=0.005,AA3,IF(Z3=0,AA3,\"<1%\"))","v":"<1%"}]
["Land North of Linthouse Lane, south of the Dismantled Railway Line, west of Kitchen Lane and east of",138,148,148,0,0,0,{"$f":"I4-#REF!","v":{"$error":"#REF!"}},{"$f":"#REF!/D4","v":{"$error":"#REF!"}},{"$f":"IF(I4>=0.005,I4,IF(#REF!=0,I4,\"<1%\"))","v":{"$error":"#REF!"}},0,0,0,0,0,1,null,0,0.33496486498883399,2.2632761147894187E-3,"<1%",0.42130762767513302,5.8339704517769648E-4,2.8466731599671152E-3,"<1%",0.60858472530876695,3.5286619096112693E-3,4.1120589547889658E-3,"<1%",0.37995165704299999,{"$f":"AD4/C4","v":2.5672409259662162E-3},0.46454908203400003,{"$f":"AF4/C4","v":3.1388451488783787E-3},{"$f":"AG4-AE4","v":5.7160422291216255E-4}]
["Land at Perton Road, Perton",192,2.4,2.4,0,0,0,{"$f":"I5-#REF!","v":{"$error":"#REF!"}},{"$f":"#REF!/D5","v":{"$error":"#REF!"}},{"$f":"IF(I5>=0.005,I5,IF(#REF!=0,I5,\"<1%\"))","v":{"$error":"#REF!"}},0,0,0,0,0,1,null,0,0,0,0,0,0,0,0,0,0,0,0,3.1458839415600001E-2,{"$f":"AD5/C5","v":1.3107849756500001E-2},2.8961288925600001E-2,{"$f":"AF5/C5","v":1.2067203719E-2},{"$f":"AG5-AE5","v":-1.0406460375000006E-3}]
["Dadford’s Bridge Industrial Estate, Plant Street Wordsley",187,0.46,0.46,0,0,0,{"$f":"I6-#REF!","v":{"$error":"#REF!"}},{"$f":"#REF!/D6","v":{"$error":"#REF!"}},{"$f":"IF(I6>=0.005,I6,IF(#REF!=0,I6,\"<1%\"))","v":{"$error":"#REF!"}},0,0,0,0,0,1,null,0,0,0,0,0,0,0,0,1.5642992082997E-2,3.4006504528254343E-2,3.4006504528254343E-2,3.4006504528254343E-2]
["Opposite One Hundred acre school, Aldridge Road, Walsall",185,7.5,7.5,0,0,0,{"$f":"I7-#REF!","v":{"$error":"#REF!"}},{"$f":"#REF!/D7","v":{"$error":"#REF!"}},{"$f":"IF(I7>=0.005,I7,IF(#REF!=0,I7,\"<1%\"))","v":{"$error":"#REF!"}},0,0,0,0,0,1,null,0,4.5995986973989003E-2,6.1327982631985333E-3,6.1327982631985333E-3,0.14615422453313101,1.3354431674552268E-2,1.9487229937750802E-2,1.3354431674552268E-2,1.0392375549117701,0.12521057564701707,0.13856500732156934,0.12521057564701707]
["Merry Hill, Brierley Hill",184,53.06,53.06,0,0,0,{"$f":"I8-#REF!","v":{"$error":"#REF!"}},{"$f":"#REF!/D8","v":{"$error":"#REF!"}},{"$f":"IF(I8>=0.005,I8,IF(#REF!=0,I8,\"<1%\"))","v":{"$error":"#REF!"}},0,0,0,0,0,1,null,0,1.5323749812993599,2.8880041110052015E-2,2.8880041110052015E-2,5.0775906419672898,6.6815221648472103E-2,9.5695262758524122E-2,6.6815221648472103E-2,17.122275485852398,0.25588126319608873,0.32269648484456082,0.25588126319608873]
["Merry Hill, Brierley Hill",184,21.85,21.85,0,0,0,{"$f":"I9-#REF!","v":{"$error":"#REF!"}},{"$f":"#REF!/D9","v":{"$error":"#REF!"}},{"$f":"IF(I9>=0.005,I9,IF(#REF!=0,I9,\"<1%\"))","v":{"$error":"#REF!"}},0,0,0,0,0,1,null,0,0.29480967326977597,1.349243355925748E-2,1.349243355925748E-2,0.97553747179707995,3.1154590321615744E-2,4.4647023880873223E-2,3.1154590321615744E-2,3.1893687541711402,0.11481194305006115,0.14596653337167689,0.11481194305006115]
["Land at Electrium Point, Forge Road, Willenhall, Walsall",183,0.4,0.4,0,0,0,{"$f":"I10-#REF!","v":{"$error":"#REF!"}},{"$f":"#REF!/D10","v":{"$error":"#REF!"}},{"$f":"IF(I10>=0.005,I10,IF(#REF!=0,I10,\"<1%\"))","v":{"$error":"#REF!"}},0,0,0,0,0,1,null,0,3.741451613656E-3,9.3536290341399986E-3,9.3536290341399986E-3,1.0541451613656E-2,1.6999999999999998E-2,2.6353629034139996E-2,1.6999999999999998E-2,1.6768737677299E-2,2.4921844193247503E-2,4.1921844193247501E-2,2.4921844193247503E-2]
["Aldridge Wyevale Garden Centre,  Chester Road, Aldridge, Walsall",182,1.03,1.03,0,0,0,{"$f":"I11-#REF!","v":{"$error":"#REF!"}},{"$f":"#REF!/D11","v":{"$error":"#REF!"}},{"$f":"IF(I11>=0.005,I11,IF(#REF!=0,I11,\"<1%\"))","v":{"$error":"#REF!"}},0,0,0,0,0,1,null,0,0,0,0,0,0,0,0,0,0,0,0]
["Land at Pennwood, Wolverhampton",180,114.8,114.8,0,0,0,{"$f":"I12-#REF!","v":{"$error":"#REF!"}},{"$f":"#REF!/D12","v":{"$error":"#REF!"}},{"$f":"IF(I12>=0.005,I12,IF(#REF!=0,I12,\"<1%\"))","v":{"$error":"#REF!"}},0,0,0,0,0,1,null,0,0.75540446741552703,6.5801782875916986E-3,6.5801782875916986E-3,1.1134074322780401,3.118492725283215E-3,9.6986710128749137E-3,"<1%",3.3093513165914201,2.5708609335617656E-2,2.8827102060900871E-2,2.5708609335617656E-2,4.4028900418600001,{"$f":"AD12/C12","v":3.8352700713066207E-2},4.6392571440500001,{"$f":"AF12/C12","v":4.041164759625436E-2},{"$f":"AG12-AE12","v":2.0589468831881536E-3}]
["Turls Hill Drive ",179,0.82,0.82,0,0,0,{"$f":"I13-#REF!","v":{"$error":"#REF!"}},{"$f":"#REF!/D13","v":{"$error":"#REF!"}},{"$f":"IF(I13>=0.005,I13,IF(#REF!=0,I13,\"<1%\"))","v":{"$error":"#REF!"}},0,0,0,0,0,1,null,0,0,0,0,0,0,0,0,0,0,0,0]
["Land west of foxcote farm, Oldnall Lane, Wollescote, Stourbridge",178,6.87,6.87,0,0,0,{"$f":"I14-#REF!","v":{"$error":"#REF!"}},{"$f":"#REF!/D14","v":{"$error":"#REF!"}},{"$f":"IF(I14>=0.005,I14,IF(#REF!=0,I14,\"<1%\"))","v":{"$error":"#REF!"}},0,0,0,0,0,1,null,0,9.5865421925229993E-3,1.3954209887224161E-3,"<1%",3.0457231432924999E-2,3.0379460320818048E-3,4.4333670208042209E-3,"<1%",0.24810801598349,3.3076757895646E-2,3.6114703927727802E-2,3.3076757895646E-2]
["263a Land adjacent to Sutton Road, Wzlsall",176,11.92,11.92,0,0,0,{"$f":"I15-#REF!","v":{"$error":"#REF!"}},{"$f":"#REF!/D15","v":{"$error":"#REF!"}},{"$f":"IF(I15>=0.005,I15,IF(#REF!=0,I15,\"<1%\"))","v":{"$error":"#REF!"}},0,0,0,0,0,1,null,0,9.5100094238607005E-2,7.978195825386494E-3,7.978195825386494E-3,0.21312620307979099,9.9015191980859046E-3,1.7879715023472399E-2,9.9015191980859046E-3,0.96387713761330696,7.0960656776184808E-2,8.0862175974270714E-2,7.0960656776184808E-2]
["Land adjoining Bilston Street/Whites Drive, Dudley",175,2.5,2.5,0,0,0,{"$f":"I16-#REF!","v":{"$error":"#REF!"}},{"$f":"#REF!/D16","v":{"$error":"#REF!"}},{"$f":"IF(I16>=0.005,I16,IF(#REF!=0,I16,\"<1%\"))","v":{"$error":"#REF!"}},0,0,0,0,0,1,null,0,0.108685617195537,4.3474246878214801E-2,4.3474246878214801E-2,0.16462996147596301,2.2377737712170401E-2,6.5851984590385201E-2,2.2377737712170401E-2,0.26089821119679102,8.198154676654601E-2,0.10435928447871641,8.198154676654601E-2]
["Land at Little Aston Road, Aldridge.",173,7.8,7.8,0,0,0,{"$f":"I17-#REF!","v":{"$error":"#REF!"}},{"$f":"#REF!/D17","v":{"$error":"#REF!"}},{"$f":"IF(I17>=0.005,I17,IF(#REF!=0,I17,\"<1%\"))","v":{"$error":"#REF!"}},0,0,0,0,0,1,null,0,0,0,0,0,0,0,0,0,0,0,0]
["Land at Chester Road, Streetly, Walsall",172,25.6,25.6,0,0,0,{"$f":"I18-#REF!","v":{"$error":"#REF!"}},{"$f":"#REF!/D18","v":{"$error":"#REF!"}},{"$f":"IF(I18>=0.005,I18,IF(#REF!=0,I18,\"<1%\"))","v":{"$error":"#REF!"}},0,0,0,0,0,1,null,0,0.23811607000026899,9.3014089843855077E-3,9.3014089843855077E-3,1.2898844224894701,4.1084701269109417E-2,5.0386110253494924E-2,4.1084701269109417E-2,6.1975614429797199,0.20100754259728587,0.2420922438663953,0.20100754259728587]
["Swindon Road/Enville Road, Wall Heath, Kingswinford",171,26,26,0,0,0,{"$f":"I19-#REF!","v":{"$error":"#REF!"}},{"$f":"#REF!/D19","v":{"$error":"#REF!"}},{"$f":"IF(I19>=0.005,I19,IF(#REF!=0,I19,\"<1%\"))","v":{"$error":"#REF!"}},1.3683976523958001E-2,0.01,0.01,3.8461538461538462E-4,"<1%",0.99961538461538457,null,0,0.14476738768840999,5.5679764495542303E-3,5.5679764495542303E-3,0.57515074719509796,1.6553206134872614E-2,2.2121182584426843E-2,1.6553206134872614E-2,1.27379661830201,3.2438971492127766E-2,4.899217762700038E-2,3.2438971492127766E-2]
["Watery Lane, Wordsley, Stourbridge",169,0.9,0.9,4.4715264999999997E-2,0.04,4.4444444444444446E-2,{"$f":"I20-#REF!","v":{"$error":"#REF!"}},{"$f":"#REF!/D20","v":{"$error":"#REF!"}},{"$f":"IF(I20>=0.005,I20,IF(#REF!=0,I20,\"<1%\"))","v":{"$error":"#REF!"}},4.5479157476188997E-2,0.05,1.0000000000000002E-2,5.5555555555555559E-2,5.5555555555555559E-2,0.94444444444444442,null,0,9.7095494525839994E-3,1.0788388280648887E-2,1.0788388280648887E-2,3.4783295339793997E-2,2.7859717652455554E-2,3.8648105933104443E-2,2.7859717652455554E-2,4.6741120233846002E-2,2.4074860385151116E-2,5.193457803760667E-2,2.4074860385151116E-2]
{"$rows_left_out":769}